Target
Histone lysine demethylase PHF8
Ligand
BDBM276085
Substrate
Meas. Tech.
PHF8 Assay
IC50
>500±n/a nM
Citation
 Chen, YKNie, ZStafford, JAVeal, JM Histone demethylase inhibitors US Patent  US9896436 Publication Date 2/20/2018 
Target
Name:
Histone lysine demethylase PHF8
Synonyms:
Histone lysine demethylase PHF8 KIAA1111 PHD finger protein 8 PHF8_HUMAN | ZNF422
Type:
Protein
Mol. Mass.:
117889.91
Organism:
Homo sapiens (Human)
Description:
Q9UPP1
Residue:
1060
  
Inhibitor
Name:
BDBM276085
Synonyms:
1-[(4-chlorophenyl)methyl]-4-{1H-[1,2,3]triazolo[4,5-c]pyridin-6-yl}-1H-imidazole US10174003, Example 47 | US9896436, Example 47
Type:
Small organic molecule
Emp. Form.:
C15H11ClN6
Mol. Mass.:
310.741
SMILES:
Clc1ccc(Cn2cnc(c2)-c2cc3[nH]nnc3cn2)cc1
: