Target
Histamine H4 receptor
Ligand
BDBM22561
Substrate
BDBM7966
Meas. Tech.
Radioligand Binding Assay
pH
7.5±n/a
Temperature
298.15±n/a K
Ki
65±n/a nM
Citation
 Lee-Dutra, AArienti, KLBuzard, DJHack, MDKhatuya, HDesai, PJNguyen, SThurmond, RLKarlsson, LEdwards, JPBreitenbucher, JG Identification of 2-arylbenzimidazoles as potent human histamine H4 receptor ligands. Bioorg Med Chem Lett 16:6043-8 (2006)  
Target
Name:
Histamine H4 receptor
Synonyms:
AXOR35 GPCR105 HH4R HRH4 Histamine H4 receptor Histamine receptor (H3 and H4) SP9144
Type:
G Protein-Coupled Receptor (GPCR)
Mol. Mass.:
44517.02
Organism:
Homo sapiens (Human)
Description:
Binding assays were using CHO cells stably expressing hH4R receptors.
Residue:
390
  
Inhibitor
Name:
BDBM22561
Synonyms:
2-arylbenzimidazole derivative, 7 | 5-tert-butyl-2-{3-chloro-4-[3-(4-methylpiperazin-1-yl)propoxy]phenyl}-1H-1,3-benzodiazole
Type:
Small organic molecule
Emp. Form.:
C25H33ClN4O
Mol. Mass.:
441.009
SMILES:
CN1CCN(CCCOc2ccc(cc2Cl)-c2nc3ccc(cc3[nH]2)C(C)(C)C)CC1
:
Substrate
Name:
BDBM7966
Synonyms:
2-(1H-imidazol-4-yl)ethan-1-amine CHEMBL90 Ergotidine Histamine Peremin | [3H]histamine
Type:
Small organic molecule
Emp. Form.:
C5H9N3
Mol. Mass.:
111.1451
SMILES:
NCCc1cnc[nH]1
: