Target
Histamine H4 receptor
Ligand
BDBM22566
Substrate
BDBM7966
Meas. Tech.
Radioligand Binding Assay
pH
7.5±n/a
Temperature
298.15±n/a K
Ki
2.6±0.3 nM
Citation
 Thurmond, RLDesai, PJDunford, PJFung-Leung, WPHofstra, CLJiang, WNguyen, SRiley, JPSun, SWilliams, KNEdwards, JPKarlsson, L A potent and selective histamine H4 receptor antagonist with anti-inflammatory properties. J Pharmacol Exp Ther 309:404-13 (2004)  
Target
Name:
Histamine H4 receptor
Synonyms:
HH4R Hrh4
Type:
G Protein-Coupled Receptor (GPCR)
Mol. Mass.:
44045.07
Organism:
Rattus norvegicus (rat)
Description:
Cell pellets from SK-N-MC cells transfected with rat H4 receptor were used in binding assay.
Residue:
391
  
Inhibitor
Name:
BDBM22566
Synonyms:
5-chloro-2-[(4-methylpiperazin-1-yl)carbonyl]-1H-indole JNJ 7777120
Type:
Small organic molecule
Emp. Form.:
C14H16ClN3O
Mol. Mass.:
277.749
SMILES:
CN1CCN(CC1)C(=O)c1cc2cc(Cl)ccc2[nH]1
:
Substrate
Name:
BDBM7966
Synonyms:
2-(1H-imidazol-4-yl)ethan-1-amine CHEMBL90 Ergotidine Histamine Peremin | [3H]histamine
Type:
Small organic molecule
Emp. Form.:
C5H9N3
Mol. Mass.:
111.1451
SMILES:
NCCc1cnc[nH]1
: