Target
Liver carboxylesterase 1
Ligand
BDBM22832
Substrate
BDBM22723
Meas. Tech.
Enzyme Inhibition Assay
Ki
21000±n/a nM
Citation
 Hyatt, JLMoak, THatfield, MJTsurkan, LEdwards, CCWierdl, MDanks, MKWadkins, RMPotter, PM Selective inhibition of carboxylesterases by isatins, indole-2,3-diones. J Med Chem 50:1876-85 (2007)  
Target
Name:
Liver carboxylesterase 1
Synonyms:
Acyl coenzyme A:cholesterol acyltransferase CES1 EST1_HUMAN Serine hydrolase (CES1)
Type:
Protein
Mol. Mass.:
62520.83
Organism:
Homo sapiens (Human)
Description:
Residue:
567
  
Inhibitor
Name:
BDBM22832
Synonyms:
5,6-dichloro-2,3-dihydro-1H-indole-2,3-dione | Isatin-based compound, 52
Type:
Small organic molecule
Emp. Form.:
C8H3Cl2NO2
Mol. Mass.:
216.021
SMILES:
Clc1cc2NC(=O)C(=O)c2cc1Cl
:
Substrate
Name:
BDBM22723
Synonyms:
2-nitrophenyl acetate o-NPA | o-nitrophenyl acetate
Type:
Small organic molecule
Emp. Form.:
C8H7NO4
Mol. Mass.:
181.1455
SMILES:
CC(=O)Oc1ccccc1[N+]([O-])=O
: