Target
Prostaglandin G/H synthase 2
Ligand
BDBM22955
Substrate
BDBM22319
Meas. Tech.
Time-Dependent Inhibition Assay
Temperature
310.15±n/a K
IC50
50±n/a nM
Comments
extracted
Citation
 Kalgutkar, ASCrews, BCRowlinson, SWMarnett, ABKozak, KRRemmel, RPMarnett, LJ Biochemically based design of cyclooxygenase-2 (COX-2) inhibitors: facile conversion of nonsteroidal antiinflammatory drugs to potent and highly selective COX-2 inhibitors. Proc Natl Acad Sci U S A 97:925-30 (2000)  
Target
Name:
Prostaglandin G/H synthase 2
Synonyms:
Cox-2 Cyclooxygenase-2 Glucocorticoid-regulated inflammatory cyclooxygenase Macrophage activation-associated marker protein P71/73 PGH synthase 2 PGHS-2 Pghs-b Prostaglandin H2 synthase 2 Ptgs2 Tis10
Type:
Protein
Mol. Mass.:
69020.39
Organism:
Mus musculus (Mouse)
Description:
Q05769
Residue:
604
  
Inhibitor
Name:
BDBM22955
Synonyms:
4-methoxyphenyl 2-{1-[(4-chlorophenyl)carbonyl]-5-methoxy-2-methyl-1H-indol-3-yl}acetate Indomethacin derivative, 8
Type:
Small organic molecule
Emp. Form.:
C26H22ClNO5
Mol. Mass.:
463.91
SMILES:
COc1ccc(OC(=O)Cc2c(C)n(C(=O)c3ccc(Cl)cc3)c3ccc(OC)cc23)cc1
:
Substrate
Name:
BDBM22319
Synonyms:
(5Z,8Z,11Z,14Z)-icosa-5,8,11,14-tetraenoic acid Arachidonic acid (AA) [1-14C]Arachidonic acid
Type:
Unsaturated fatty acid
Emp. Form.:
C20H32O2
Mol. Mass.:
304.4669
SMILES:
CCCCC\C=C/C\C=C/C\C=C/C\C=C/CCCC(O)=O
: