Target
Isocitrate dehydrogenase [NADP] cytoplasmic [R132C]
Ligand
BDBM375168
Substrate
Meas. Tech.
Cellular 2-HG Assay Using HCT116 Mutant IDH1 Cells
IC50
<10±n/a nM
Citation
 Lin, JEricsson, ACampbell, AGustafson, GWang, ZDiebold, RBAshwell, SLancia, Jr., DRCaravella, JALu, W Pyridinyl quinolinone derivatives as mutant-isocitrate dehydrogenase inhibitors US Patent  US10253015 Publication Date 4/9/2019 
Target
Name:
Isocitrate dehydrogenase [NADP] cytoplasmic [R132C]
Synonyms:
IDH1 IDH1(R132C) Isocitrate dehydrogenase (IDH1)(R132C) Isocitrate dehydrogenase [NADP] cytoplasmic (IDH1) (R132C) | PICD
Type:
Enzyme Catalytic Domain
Mol. Mass.:
46607.23
Organism:
Homo sapiens (Human)
Description:
O75874[R132C]
Residue:
414
  
Inhibitor
Name:
BDBM375168
Synonyms:
6-{[(1S)-1-[6-chloro-2-oxo- | US10253015, Compound I-28
Type:
Small organic molecule
Emp. Form.:
C24H20ClN5O2
Mol. Mass.:
445.901
SMILES:
C[C@H](Nc1ccc(C#N)c(C)n1)c1cc2cc(Cl)c(OCc3ccccn3)cc2[nH]c1=O
: