Target
DNA ligase 1
Ligand
BDBM23039
Substrate
BDBM23028
Meas. Tech.
FAAH Inhibition Assay
pH
9±n/a
Temperature
295.15±n/a K
Ki
2.5±0.5 nM
IC50
20±n/a nM
Citation
 Hardouin, CKelso, MJRomero, FARayl, TJLeung, DHwang, ICravatt, BFBoger, DL Structure-activity relationships of alpha-ketooxazole inhibitors of fatty acid amide hydrolase. J Med Chem 50:3359-68 (2007)  
Target
Name:
DNA ligase 1
Synonyms:
ATP-dependent DNA ligase DNLI1_HUMAN LIG1 | Polydeoxyribonucleotide synthase [ATP]
Type:
Enzyme
Mol. Mass.:
101721.76
Organism:
Homo sapiens (Human)
Description:
Residue:
919
  
Inhibitor
Name:
BDBM23039
Synonyms:
7-(3-methoxyphenyl)-1-[5-(pyridin-2-yl)-1,3-oxazol-2-yl]heptan-1-one | alpha-ketooxazole, 5k
Type:
Small organic molecule
Emp. Form.:
C22H24N2O3
Mol. Mass.:
364.4376
SMILES:
COc1cccc(CCCCCCC(=O)c2ncc(o2)-c2ccccn2)c1
:
Substrate
Name:
BDBM23028
Synonyms:
(9Z)-octadec-9-enamide CHEMBL15927 Oleic acid amide | Oleylamide
Type:
Emp. Form.:
C18H35NO
Mol. Mass.:
281.4766
SMILES:
CCCCCCCC\C=C/CCCCCCCC(N)=O
: