Target
DNA ligase 1
Ligand
BDBM23071
Substrate
BDBM23028
Meas. Tech.
FAAH Inhibition Assay
Temperature
298.15±n/a K
Ki
25±n/a nM
IC50
100±n/a nM
Comments
extracted
Citation
 Hardouin, CKelso, MJRomero, FARayl, TJLeung, DHwang, ICravatt, BFBoger, DL Structure-activity relationships of alpha-ketooxazole inhibitors of fatty acid amide hydrolase. J Med Chem 50:3359-68 (2007)  
Target
Name:
DNA ligase 1
Synonyms:
ATP-dependent DNA ligase DNLI1_HUMAN LIG1 | Polydeoxyribonucleotide synthase [ATP]
Type:
Enzyme
Mol. Mass.:
101721.76
Organism:
Homo sapiens (Human)
Description:
Residue:
919
  
Inhibitor
Name:
BDBM23071
Synonyms:
3-[3-(benzyloxy)phenyl]-1-[5-(pyridin-2-yl)-1,3-oxazol-2-yl]propan-1-one | alpha-ketooxazole, 11c
Type:
Small organic molecule
Emp. Form.:
C24H20N2O3
Mol. Mass.:
384.4272
SMILES:
O=C(CCc1cccc(OCc2ccccc2)c1)c1ncc(o1)-c1ccccn1
:
Substrate
Name:
BDBM23028
Synonyms:
(9Z)-octadec-9-enamide CHEMBL15927 Oleic acid amide | Oleylamide
Type:
Emp. Form.:
C18H35NO
Mol. Mass.:
281.4766
SMILES:
CCCCCCCC\C=C/CCCCCCCC(N)=O
: