Target
Aurora kinase B
Ligand
BDBM50044651
Substrate
Meas. Tech.
Inhibition Assay
IC50
<100±n/a nM
Citation
 Sampson, PBLiu, YLi, SForrest, BTPauls, HWEdwards, LGFeher, MPatel, NKLaufer, R Kinase inhibitors and method of treating cancer US Patent  US9907800 Publication Date 3/6/2018 
Target
Name:
Aurora kinase B
Synonyms:
AIK2 AIM1 ARK2 AURKB_HUMAN Aurora B-INCENP Aurora kinase B (AURKB) STK-1 STK12 Serine/threonine-protein kinase aurora B
Type:
Protein
Mol. Mass.:
39327.72
Organism:
Homo sapiens (Human)
Description:
Q96GD4
Residue:
344
  
Inhibitor
Name:
BDBM50044651
Synonyms:
CHEMBL3353349 US9907800, Example A214
Type:
Small organic molecule
Emp. Form.:
C29H26F2N4O2
Mol. Mass.:
500.5391
SMILES:
CN(C)Cc1ccc(\C=C\c2n[nH]c3cc(ccc23)[C@@H]2C[C@@]22C(=O)Nc3ccc(OC(F)F)cc23)cc1
: