Target
Homoisocitrate dehydrogenase
Ligand
BDBM23221
Substrate
BDBM23214
Meas. Tech.
Enzyme Inhibition Assay
pH
7.8±n/a
Temperature
301.15±n/a K
Ki
88000±n/a nM
Km
211000±n/a nM
kcat
46±n/a 1/sec
Citation
 Yamamoto, TMiyazaki, KEguchi, T Substrate specificity analysis and inhibitor design of homoisocitrate dehydrogenase. Bioorg Med Chem 15:1346-55 (2007)  
Target
Name:
Homoisocitrate dehydrogenase
Synonyms:
DraHICDH Isocitrate dehydrogenase
Type:
Enzyme
Mol. Mass.:
35741.95
Organism:
Deinococcus radiodurans
Description:
Q76G12
Residue:
332
  
Inhibitor
Name:
BDBM23221
Synonyms:
(2S,3R)-2-ethenyl-3-hydroxybutanedioic acid | Vinylmalate, 19
Type:
Small organic molecule
Emp. Form.:
C6H8O5
Mol. Mass.:
160.1247
SMILES:
[H][C@](O)(C(O)=O)[C@]([H])(C=C)C(O)=O
:
Substrate
Name:
BDBM23214
Synonyms:
(-)-homoisocitric acid (2R,3S)-Homoisocitrate | Homoisocitrate
Type:
Small organic molecule
Emp. Form.:
C7H10O7
Mol. Mass.:
206.1501
SMILES:
[H][C@](O)(C(O)=O)[C@]([H])(CCC(O)=O)C(O)=O
: