Target
Coagulation factor XII
Ligand
BDBM23549
Substrate
BDBM12680
Meas. Tech.
IC50 Value Determination
pH
7.9±n/a
Temperature
295.15±n/a K
IC50
>50000±n/a nM
Citation
 Robert, SBertolla, CMasereel, BDogné, JMPochet, L Novel 3-carboxamide-coumarins as potent and selective FXIIa inhibitors. J Med Chem 51:3077-80 (2008)  
Target
Name:
Coagulation factor XII
Synonyms:
Beta-factor XIIa part 1 Carboxylesterase 2 (intestine, liver) Coagulation factor XII (FXII) Coagulation factor XIIa light chain FA12_HUMAN Factor XIIa (fXIIa) Hageman factor
Type:
Enzyme
Mol. Mass.:
67810.07
Organism:
Homo sapiens (Human)
Description:
P00748
Residue:
615
  
Inhibitor
Name:
BDBM23549
Synonyms:
3-Carboxamide-coumarin deriv., 47 | 6-bromo-8-methoxy-2-oxo-N-phenyl-2H-chromene-3-carboxamide
Type:
Small organic molecule
Emp. Form.:
C17H12BrNO4
Mol. Mass.:
374.185
SMILES:
COc1cc(Br)cc2cc(C(=O)Nc3ccccc3)c(=O)oc12
:
Substrate
Name:
BDBM12680
Synonyms:
(2S)-N-[(2S)-5-carbamimidamido-2-[(4-nitrophenyl)amino]pentanoyl]-3-phenyl-2-[(2R)-pyrrolidin-2-ylformamido]propanamide H-D-Pro-Phe-Arg-p-nitroanilide | prolyl-phenylalanyl-arginine-p-nitroanilide
Type:
Small organic molecule
Emp. Form.:
C26H34N8O5
Mol. Mass.:
538.5988
SMILES:
N\C([NH-])=[NH+]/CCCC(NC(=O)C(Cc1ccccc1)NC(=O)C1CCCN1)C(=O)Nc1ccc(cc1)[N+]([O-])=O
: