Target
Rho-associated protein kinase 2
Ligand
BDBM376337
Substrate
Meas. Tech.
In Vitro Assay
IC50
370±n/a nM
Citation
 Quan, MLHu, ZWang, CPatil, S Tricyclic pyrido-carboxamide derivatives as rock inhibitors US Patent  US9914740 Publication Date 3/13/2018 
Target
Name:
Rho-associated protein kinase 2
Synonyms:
KIAA0619 ROCK2 Rho kinase 2 (ROCKII) Rho-associated protein kinase 2 (ROCK2) Rho-associated protein kinase 2/Transforming protein RhoA Rho-associated, coiled-coil-containing protein kinase II p164 ROCK-2
Type:
Protein
Mol. Mass.:
160885.43
Organism:
Homo sapiens (Human)
Description:
O75116
Residue:
1388
  
Inhibitor
Name:
BDBM376337
Synonyms:
N-(3-(5,6,7,8-tetra- hydroimidazo[1,2-a] pyrazin-3-yl)benzyl)- 5H-chromeno[3,4-c] pyridine-8- carboxamide | US9914740, IV-18
Type:
Small organic molecule
Emp. Form.:
C26H23N5O2
Mol. Mass.:
437.4931
SMILES:
O=C(NCc1cccc(c1)-c1cnc2CNCCn12)c1ccc-2c(OCc3cnccc-23)c1
: