Target
Suppressor of tumorigenicity 14 protein
Ligand
BDBM23887
Substrate
BDBM23868
Meas. Tech.
Determination of Inhibition Constants
pH
8±n/a
Temperature
298.15±n/a K
Ki
14±n/a nM
Citation
 Steinmetzer, TSchweinitz, AStürzebecher, ADönnecke, DUhland, KSchuster, OSteinmetzer, PMüller, FFriedrich, RThan, MEBode, WStürzebecher, J Secondary amides of sulfonylated 3-amidinophenylalanine. New potent and selective inhibitors of matriptase. J Med Chem 49:4116-26 (2006)  
Target
Name:
Suppressor of tumorigenicity 14 protein
Synonyms:
Epithin MT-SP1 PRSS14 SNC19 ST14_HUMAN Suppressor of tumorigenicity 14 protein TADG15
Type:
Single-pass type II membrane protein
Mol. Mass.:
94769.23
Organism:
Homo sapiens (Human)
Description:
Q9Y5Y6
Residue:
855
  
Inhibitor
Name:
BDBM23887
Synonyms:
3-amidinophenylalanine deriv., 31 | 4-({4-[(2S)-3-(3-carbamimidoylphenyl)-2-{[2,4,6-tris(propan-2-yl)benzene]sulfonamido}propanoyl]piperazin-1-yl}carbonyl)piperidine-1-carboximidamide
Type:
Small organic molecule
Emp. Form.:
C36H54N8O4S
Mol. Mass.:
694.93
SMILES:
CC(C)c1cc(C(C)C)c(c(c1)C(C)C)S(=O)(=O)N[C@@H](Cc1cccc(c1)C(N)=N)C(=O)N1CCN(CC1)C(=O)C1CCN(CC1)C(N)=N
:
Substrate
Name:
BDBM23868
Synonyms:
(2S)-5-carbamimidamido-2-{2-[(2R)-3-(4-hydroxycyclohexyl)-2-methanesulfonamidopropanamido]acetamido}-N-(4-nitrophenyl)pentanamide Pefachrome tPA
Type:
chromogenic substrate
Emp. Form.:
C24H38N8O8S
Mol. Mass.:
598.672
SMILES:
CS(=O)(=O)NC(CC1CCC(O)CC1)C(=O)NCC(=O)NC(CCC\[NH+]=C(/N)[NH-])C(=O)Nc1ccc(cc1)[N+]([O-])=O
: