Target
Urokinase-type plasminogen activator
Ligand
BDBM23895
Substrate
BDBM23922
Meas. Tech.
Determination of Inhibition Constants
Ki
7700±n/a nM
Citation
 Steinmetzer, TSchweinitz, AStürzebecher, ADönnecke, DUhland, KSchuster, OSteinmetzer, PMüller, FFriedrich, RThan, MEBode, WStürzebecher, J Secondary amides of sulfonylated 3-amidinophenylalanine. New potent and selective inhibitors of matriptase. J Med Chem 49:4116-26 (2006)  
Target
Name:
Urokinase-type plasminogen activator
Synonyms:
3.4.21.73 U-plasminogen activator Urokinase Urokinase-type plasminogen activator chain B Urokinase-type plasminogen activator short chain A uPA
Type:
Enzyme
Mol. Mass.:
48528.62
Organism:
Homo sapiens (Human)
Description:
P00749
Residue:
431
  
Inhibitor
Name:
BDBM23895
Synonyms:
3-amidinophenylalanine deriv., 39 | N-(2-aminoethyl)-1-[(2S)-3-(3-carbamimidoylphenyl)-2-[(9,10-dioxo-9,10-dihydroanthracene-2-)sulfonamido]propanoyl]piperidine-4-carboxamide
Type:
Small organic molecule
Emp. Form.:
C32H34N6O6S
Mol. Mass.:
630.714
SMILES:
NCCNC(=O)C1CCN(CC1)C(=O)[C@H](Cc1cccc(c1)C(N)=N)NS(=O)(=O)c1ccc2C(=O)c3ccccc3C(=O)c2c1
:
Substrate
Name:
BDBM23922
Synonyms:
Bz-beta-Ala-Gly-Arg-pNA | benzoyl-beta-Ala-Gly-Arg-p-nitroanilide
Type:
Emp. Form.:
Mol. Mass.:
SMILES:
: