Target
Urokinase-type plasminogen activator
Ligand
BDBM23918
Substrate
BDBM23922
Meas. Tech.
Determination of Inhibition Constants
Ki
8000±n/a nM
Citation
 Steinmetzer, TSchweinitz, AStürzebecher, ADönnecke, DUhland, KSchuster, OSteinmetzer, PMüller, FFriedrich, RThan, MEBode, WStürzebecher, J Secondary amides of sulfonylated 3-amidinophenylalanine. New potent and selective inhibitors of matriptase. J Med Chem 49:4116-26 (2006)  
Target
Name:
Urokinase-type plasminogen activator
Synonyms:
3.4.21.73 U-plasminogen activator Urokinase Urokinase-type plasminogen activator chain B Urokinase-type plasminogen activator short chain A uPA
Type:
Enzyme
Mol. Mass.:
48528.62
Organism:
Homo sapiens (Human)
Description:
P00749
Residue:
431
  
Inhibitor
Name:
BDBM23918
Synonyms:
3-amidinophenylalanine deriv., 60 | 4-amino-N-(3-{[(2S)-1-[4-(2-aminoethyl)piperidin-1-yl]-3-(3-carbamimidoylphenyl)-1-oxopropan-2-yl]sulfamoyl}phenyl)butanamide
Type:
Small organic molecule
Emp. Form.:
C27H39N7O4S
Mol. Mass.:
557.708
SMILES:
NCCCC(=O)Nc1cccc(c1)S(=O)(=O)N[C@@H](Cc1cccc(c1)C(N)=N)C(=O)N1CCC(CCN)CC1
:
Substrate
Name:
BDBM23922
Synonyms:
Bz-beta-Ala-Gly-Arg-pNA | benzoyl-beta-Ala-Gly-Arg-p-nitroanilide
Type:
Emp. Form.:
Mol. Mass.:
SMILES:
: