Target
Coagulation factor X
Ligand
BDBM23877
Substrate
BDBM23925
Meas. Tech.
Determination of Inhibition Constants
Ki
4600±n/a nM
Citation
 Steinmetzer, TSchweinitz, AStürzebecher, ADönnecke, DUhland, KSchuster, OSteinmetzer, PMüller, FFriedrich, RThan, MEBode, WStürzebecher, J Secondary amides of sulfonylated 3-amidinophenylalanine. New potent and selective inhibitors of matriptase. J Med Chem 49:4116-26 (2006)  
Target
Name:
Coagulation factor X
Synonyms:
Coagulation factor X FA10_BOVIN | Factor Xa (fXa)
Type:
PROTEIN
Mol. Mass.:
54498.45
Organism:
Bos taurus
Description:
ChEMBL_1364435
Residue:
492
  
Inhibitor
Name:
BDBM23877
Synonyms:
3-[(2S)-2-(anthracene-2-sulfonamido)-3-[4-(3-carbamimidamidopropanoyl)piperazin-1-yl]-3-oxopropyl]benzene-1-carboximidamide | 3-amidinophenylalanine deriv., 21
Type:
Small organic molecule
Emp. Form.:
C32H36N8O4S
Mol. Mass.:
628.744
SMILES:
[#7]\[#6](-[#7])=[#7]/[#6]-[#6]-[#6](=O)-[#7]-1-[#6]-[#6]-[#7](-[#6]-[#6]-1)-[#6](=O)-[#6@H](-[#6]-c1cccc(c1)-[#6](-[#7])=[#7])-[#7]S(=O)(=O)c1ccc2cc3ccccc3cc2c1
:
Substrate
Name:
BDBM23925
Synonyms:
MeSO2-D-Nle-Gly-Arg-p-nitroanilide | MeSO2-D-Nle-Gly-Arg-pNA
Type:
Emp. Form.:
Mol. Mass.:
SMILES:
: