Target
Kinesin-like protein KIF11
Ligand
BDBM24116
Substrate
BDBM2
Meas. Tech.
Microtubule-Activated Eg5 ATPase Assay
pH
7±n/a
Temperature
296.15±n/a K
IC50
17900±n/a nM
Citation
 Tarby, CMKaltenbach, RFHuynh, TPudzianowski, AShen, HOrtega-Nanos, MSheriff, SNewitt, JAMcDonnell, PABurford, NFairchild, CRVaccaro, WChen, ZBorzilleri, RMNaglich, JLombardo, LJGottardis, MTrainor, GLRoussell, DL Inhibitors of human mitotic kinesin Eg5: characterization of the 4-phenyl-tetrahydroisoquinoline lead series. Bioorg Med Chem Lett 16:2095-100 (2006)  
Target
Name:
Kinesin-like protein KIF11
Synonyms:
EG5 KIF11_HUMAN Kinesin Spindle Protein Eg5 TRIP5 | kinesin spindle protein
Type:
PROTEIN
Mol. Mass.:
119138.97
Organism:
Homo sapiens (Human)
Description:
ChEMBL_1457426
Residue:
1056
  
Inhibitor
Name:
BDBM24116
Synonyms:
1-(7,8-dimethyl-4-phenyl-1,2,3,4-tetrahydroisoquinolin-2-yl)ethan-1-one | tetrahydroisoquinoline (THIQ), 21
Type:
Small organic molecule
Emp. Form.:
C19H21NO
Mol. Mass.:
279.3761
SMILES:
CC(=O)N1CC(c2ccccc2)c2ccc(C)c(C)c2C1
:
Substrate
Name:
BDBM2
Synonyms:
({[({[(2R,3S,4R,5R)-5-(6-amino-9H-purin-9-yl)-3,4-dihydroxyoxolan-2-yl]methoxy}(hydroxy)phosphoryl)oxy](hydroxy)phosphoryl}oxy)phosphonic acid Brimonidine ATP | CHEMBL14249
Type:
Nucleoside or nucleotide
Emp. Form.:
C10H16N5O13P3
Mol. Mass.:
507.181
SMILES:
Nc1ncnc2n(cnc12)[C@@H]1O[C@H](COP(O)(=O)OP(O)(=O)OP(O)(O)=O)[C@@H](O)[C@H]1O
: