Target
DNA gyrase subunit A/B
Ligand
BDBM24611
Substrate
BDBM2
Meas. Tech.
DNA Gyrase ATPase Assay
Ki
<4±n/a nM
Citation
 Charifson, PSGrillot, ALGrossman, THParsons, JDBadia, MBellon, SDeininger, DDDrumm, JEGross, CHLeTiran, ALiao, YMani, NNicolau, DPPerola, ERonkin, SShannon, DSwenson, LLTang, QTessier, PRTian, SKTrudeau, MWang, TWei, YZhang, HStamos, D Novel dual-targeting benzimidazole urea inhibitors of DNA gyrase and topoisomerase IV possessing potent antibacterial activity: intelligent design and evolution through the judicious use of structure-guided design and structure-activity relationships. J Med Chem 51:5243-63 (2008)  
Target
Name:
DNA gyrase subunit A/B
Synonyms:
DNA Gyrase | DNA gyrase A/B
Type:
A2B2 tetramer
Mol. Mass.:
Description:
Components:
This complex has 2 components.
Component 1
Name:
DNA gyrase subunit A
Synonyms:
DNA gyrase GYRA_ECOLI hisW parD
Type:
Enzyme Subunit
Mol. Mass.:
96935.15
Organism:
Escherichia coli (strain K12)
Description:
Residue:
875
  
Component 2
Name:
DNA gyrase subunit B
Synonyms:
DNA gyrase subunit B GYRB_ECOLI acrB gyrB hisU parA | pcbA
Type:
Enzyme Subunit
Mol. Mass.:
89941.28
Organism:
Escherichia coli (strain K12)
Description:
P0AES6
Residue:
804
  
Inhibitor
Name:
BDBM24611
Synonyms:
3-ethyl-1-[7-(3-fluoropyridin-2-yl)-5-(pyridin-3-yl)-1H-1,3-benzodiazol-2-yl]urea | Benzimidazole urea analogue, 15
Type:
Small organic molecule
Emp. Form.:
C20H17FN6O
Mol. Mass.:
376.387
SMILES:
CCNC(=O)Nc1nc2c(cc(cc2[nH]1)-c1cccnc1)-c1ncccc1F
:
Substrate
Name:
BDBM2
Synonyms:
({[({[(2R,3S,4R,5R)-5-(6-amino-9H-purin-9-yl)-3,4-dihydroxyoxolan-2-yl]methoxy}(hydroxy)phosphoryl)oxy](hydroxy)phosphoryl}oxy)phosphonic acid Brimonidine ATP | CHEMBL14249
Type:
Nucleoside or nucleotide
Emp. Form.:
C10H16N5O13P3
Mol. Mass.:
507.181
SMILES:
Nc1ncnc2n(cnc12)[C@@H]1O[C@H](COP(O)(=O)OP(O)(=O)OP(O)(O)=O)[C@@H](O)[C@H]1O
: