Target
NAD(P)H dehydrogenase [quinone] 1
Ligand
BDBM381843
Substrate
Meas. Tech.
BEAS-2B NQO1 MTT Assay
EC50
55±n/a nM
Citation
 Kerns, JKCallahan, JFYan, HHeightman, TDBoehm, JCWoolford, AJ NRF2 regulators US Patent  US10272095 Publication Date 4/30/2019 
Target
Name:
NAD(P)H dehydrogenase [quinone] 1
Synonyms:
Azoreductase DT-diaphorase NAD(P)H:quinone oxidoreductase 1 NQO1 Phylloquinone reductase Quinone Reductase 1 | Quinone reductase 1)
Type:
Homodimer
Mol. Mass.:
30874.82
Organism:
Homo sapiens (Human)
Description:
Residue:
274
  
Inhibitor
Name:
BDBM381843
Synonyms:
3-(1,4-Dimethyl-1H-1,2,3-benzotriazol-5-yl)-3-{1-[(4-ethylcyclohexyl)methyl]-2-oxo-1H,2H,3H,3aH,4H,8bH-indeno[1,2-b]pyrrol-7-yl}propanoic Acid | US10272095, Example 2
Type:
Small organic molecule
Emp. Form.:
C31H38N4O3
Mol. Mass.:
514.6584
SMILES:
CCC1CCC(CN2C3C(CC2=O)Cc2ccc(cc32)C(CC(O)=O)c2ccc3n(C)nnc3c2C)CC1
: