Target
NAD(P)H dehydrogenase [quinone] 1
Ligand
BDBM381845
Substrate
Meas. Tech.
BEAS-2B NQO1 MTT Assay
EC50
5.5±n/a nM
Citation
 Kerns, JKCallahan, JFYan, HHeightman, TDBoehm, JCWoolford, AJ NRF2 regulators US Patent  US10272095 Publication Date 4/30/2019 
Target
Name:
NAD(P)H dehydrogenase [quinone] 1
Synonyms:
Azoreductase DT-diaphorase NAD(P)H:quinone oxidoreductase 1 NQO1 Phylloquinone reductase Quinone Reductase 1 | Quinone reductase 1)
Type:
Homodimer
Mol. Mass.:
30874.82
Organism:
Homo sapiens (Human)
Description:
Residue:
274
  
Inhibitor
Name:
BDBM381845
Synonyms:
3-(3-(2,2-Dimethyl-2,3-dihydropyrido[3,4-f][1,4]oxazepin-4(5H)-yl)-2,3-dihydro-1H-inden-5-yl)-3-(7-methoxy-1,4-dimethyl-1H-benzo[d][1,2,3]triazol-5-yl)propanoic Acid, Formic Acid Salt | US10272095, Example 36
Type:
Small organic molecule
Emp. Form.:
C31H35N5O4
Mol. Mass.:
541.6407
SMILES:
COc1cc(C(CC(O)=O)c2ccc3CCC(N4Cc5cnccc5OC(C)(C)C4)c3c2)c(C)c2nnn(C)c12
: