Target
NAD(P)H dehydrogenase [quinone] 1
Ligand
BDBM381855
Substrate
Meas. Tech.
BEAS-2B NQO1 MTT Assay
EC50
5.5±n/a nM
Citation
 Kerns, JKCallahan, JFYan, HHeightman, TDBoehm, JCWoolford, AJ NRF2 regulators US Patent  US10272095 Publication Date 4/30/2019 
Target
Name:
NAD(P)H dehydrogenase [quinone] 1
Synonyms:
Azoreductase DT-diaphorase NAD(P)H:quinone oxidoreductase 1 NQO1 Phylloquinone reductase Quinone Reductase 1 | Quinone reductase 1)
Type:
Homodimer
Mol. Mass.:
30874.82
Organism:
Homo sapiens (Human)
Description:
Residue:
274
  
Inhibitor
Name:
BDBM381855
Synonyms:
3-(1,4-Dimethyl-1H-1,2,3-benzotriazol-5-yl)-3-{2-oxo-1-[(4-propylcyclohexyl)methyl]-1H,2H,3H,3aH,4H,8bH-indeno[1,2-b]pyrrol-7-yl}propanoic Acid | US10272095, Example 5
Type:
Small organic molecule
Emp. Form.:
C32H40N4O3
Mol. Mass.:
528.685
SMILES:
CCCC1CCC(CN2C3C(CC2=O)Cc2ccc(cc32)C(CC(O)=O)c2ccc3n(C)nnc3c2C)CC1
: