Target
NAD(P)H dehydrogenase [quinone] 1
Ligand
BDBM381890
Substrate
Meas. Tech.
BEAS-2B NQO1 MTT Assay
EC50
55±n/a nM
Citation
 Kerns, JKCallahan, JFYan, HHeightman, TDBoehm, JCWoolford, AJ NRF2 regulators US Patent  US10272095 Publication Date 4/30/2019 
Target
Name:
NAD(P)H dehydrogenase [quinone] 1
Synonyms:
Azoreductase DT-diaphorase NAD(P)H:quinone oxidoreductase 1 NQO1 Phylloquinone reductase Quinone Reductase 1 | Quinone reductase 1)
Type:
Homodimer
Mol. Mass.:
30874.82
Organism:
Homo sapiens (Human)
Description:
Residue:
274
  
Inhibitor
Name:
BDBM381890
Synonyms:
3-(3-(2,2-dimethyl-2,3-dihydrobenzo[f][1,4]oxazepin-4(5H)-yl)-2,3-dihydro-1H-inden-5-yl)-5-(2-ethyl-2H-tetrazol-5-yl)-2,2-dimethylpentanoic Acid, Trifluoroacetic Acid Salt | US10272095, Example 64
Type:
Small organic molecule
Emp. Form.:
C30H39N5O3
Mol. Mass.:
517.6624
SMILES:
CCn1nnc(CCC(c2ccc3CCC(N4Cc5ccccc5OC(C)(C)C4)c3c2)C(C)(C)C(O)=O)n1
: