Target
Cathepsin S
Ligand
BDBM25136
Substrate
BDBM19963
Meas. Tech.
Enzyme Inhibition Assay
pH
7±n/a
Temperature
295.15±n/a K
IC50
9±n/a nM
Citation
 Irie, OKosaka, TEhara, TYokokawa, FKanazawa, THirao, HIwasaki, ASakaki, JTeno, NHitomi, YIwasaki, GFukaya, HNonomura, KTanabe, KKoizumi, SUchiyama, NBevan, SJMalcangio, MGentry, CFox, AJYaqoob, MCulshaw, AJ Discovery of orally bioavailable cathepsin S inhibitors for the reversal of neuropathic pain. J Med Chem 51:5502-5 (2008)  
Target
Name:
Cathepsin S
Synonyms:
CATS_HUMAN Cathepsin S (Cat S) | cathepsin S preproprotein
Type:
Protein
Mol. Mass.:
37507.38
Organism:
Homo sapiens (Human)
Description:
P25774
Residue:
331
  
Inhibitor
Name:
BDBM25136
Synonyms:
2-cyano-pyrropyrimidine, 7b | 7-(2-cyclohexylethyl)-6-[4-(4-acetylpiperazin-1-yl)-3-fluorophenoxymethyl]-7H-pyrrolo[2,3-d]pyrimidine-2-carbonitrile
Type:
Small organic molecule
Emp. Form.:
C28H33FN6O2
Mol. Mass.:
504.599
SMILES:
CC(=O)N1CCN(CC1)c1ccc(OCc2cc3cnc(nc3n2CCC2CCCCC2)C#N)cc1F
:
Substrate
Name:
BDBM19963
Synonyms:
Cbz-Leu-Leu-Arg-AMC Z-Leu-Leu-Arg-AMC
Type:
Emp. Form.:
Mol. Mass.:
SMILES:
: