Target
Geranylgeranyl pyrophosphate synthase
Ligand
BDBM25284
Substrate
BDBM25257
Meas. Tech.
GGPP Synthase Inhibition Assay
pH
7±n/a
Temperature
310.15±n/a K
IC50
2690±n/a nM
Citation
 K-M Chen, CHudock, MPZhang, YGuo, RTCao, RNo, JHLiang, PHKo, TPChang, THChang, SCSong, YAxelson, JKumar, AWang, AHOldfield, E Inhibition of geranylgeranyl diphosphate synthase by bisphosphonates: a crystallographic and computational investigation. J Med Chem 51:5594-607 (2008)  
Target
Name:
Geranylgeranyl pyrophosphate synthase
Synonyms:
Dimethylallyltranstransferase GGPP synthetase GGPPSase Geranylgeranyl Diphosphate Synthase (GGPPS) Geranylgeranyl pyrophosphate synthetase | Geranyltranstransferase
Type:
Homooctamer; transferase
Mol. Mass.:
34867.94
Organism:
Homo sapiens (Human)
Description:
Recombinant human GGPPS was cloned and expressed in E. coli.
Residue:
300
  
Inhibitor
Name:
BDBM25284
Synonyms:
(1-hydroxy-2-{3-[3-(naphthalene-2-sulfonamido)phenyl]phenyl}-1-phosphonoethyl)phosphonic acid bisphosphonate, 6
Type:
Small organic molecule
Emp. Form.:
C24H23NO9P2S
Mol. Mass.:
563.453
SMILES:
OC(Cc1cccc(c1)-c1cccc(NS(=O)(=O)c2ccc3ccccc3c2)c1)(P(O)(O)=O)P(O)(O)=O
:
Substrate
Name:
BDBM25257
Synonyms:
({hydroxy[(3-methylbut-3-en-1-yl)oxy]phosphoryl}oxy)phosphonic acid [14C]isopentenyl diphosphate
Type:
radiolabeled substrate
Emp. Form.:
C5H12O7P2
Mol. Mass.:
246.0921
SMILES:
CC(=C)CCOP(O)(=O)OP(O)(O)=O
: