Target
Serine/threonine-protein kinase B-raf
Ligand
BDBM26041
Substrate
BDBM26040
Meas. Tech.
Fluorescence Anisoptrophy Kinase Binding Assay
pH
7.5±n/a
Temperature
295.15±n/a K
Kd
2.4±n/a nM
Citation
 Takle, AKBamford, MJDavies, SDavis, RPDean, DKGaiba, AIrving, EAKing, FDNaylor, AParr, CARay, AMReith, ADSmith, BBStaton, PCSteadman, JGStean, TOWilson, DM The identification of potent, selective and CNS penetrant furan-based inhibitors of B-Raf kinase. Bioorg Med Chem Lett 18:4373-6 (2008)  
Target
Name:
Serine/threonine-protein kinase B-raf
Synonyms:
B-RAF B-Raf proto-oncogene serine/threonine-protein kinase BRAF1 RAFB1 v-Raf murine sarcoma viral oncogene homolog B1
Type:
Serine/threonine-protein kinase
Mol. Mass.:
84446.00
Organism:
Homo sapiens (Human)
Description:
P15056
Residue:
766
  
Inhibitor
Name:
BDBM26041
Synonyms:
2-chloro-5-(2-phenyl-5-(pyridin-4-yl)-1H-imidazol-4-yl)phenol CHEMBL373011 L-779450
Type:
Small organic molecule
Emp. Form.:
C20H14ClN3O
Mol. Mass.:
347.798
SMILES:
Oc1cc(ccc1Cl)-c1[nH]c(nc1-c1ccncc1)-c1ccccc1
:
Substrate
Name:
BDBM26040
Synonyms:
5-{2-[4-(aminomethyl)phenyl]-5-(pyridin-4-yl)-1H-imidazol-4-yl}-2-chlorophenol Rhodamine green labeled 5-{2-[4-(aminomethyl)phenyl]-5-pyridin-4-yl-1H-imidazol-4-yl}-2-chlorophenol | Rhodamine green labeled ligand
Type:
fluorescent ligand
Emp. Form.:
C21H17ClN4O
Mol. Mass.:
376.839
SMILES:
NCc1ccc(cc1)-c1nc(c([nH]1)-c1ccc(Cl)c(O)c1)-c1ccncc1
: