Target
Fatty-acid amide hydrolase 1 [30-579]
Ligand
BDBM26140
Substrate
BDBM22988
Meas. Tech.
FAAH Inhibition Assay
pH
7.4±n/a
Temperature
310.15±n/a K
IC50
330±n/a nM
Citation
 Minkkilä, ASaario, SMKäsnänen, HLeppänen, JPoso, ANevalainen, T Discovery of Boronic Acids as Novel and Potent Inhibitors of Fatty Acid Amide Hydrolase. J Med Chem 51:7057-60 (2008)  
Target
Name:
Fatty-acid amide hydrolase 1 [30-579]
Synonyms:
Anandamide amidohydrolase 1 Faah Fatty Acid Amide Hydrolase Fatty-acid amide hydrolase (FAAH) Fatty-acid amide hydrolase 1 (FAAH) Oleamide hydrolase 1
Type:
Single-pass membrane protein; homodimer
Mol. Mass.:
60474.00
Organism:
Rattus norvegicus (rat)
Description:
P97612 (aa 30-579)
Residue:
550
  
Inhibitor
Name:
BDBM26140
Synonyms:
1-benzofuran-2-ylboranediol CHEMBL143399 | Phenylboronic acid, 21
Type:
Small organic molecule
Emp. Form.:
C8H7BO3
Mol. Mass.:
161.95
SMILES:
OB(O)c1cc2ccccc2o1
:
Substrate
Name:
BDBM22988
Synonyms:
(5Z,8Z,11Z,14Z)-N-(2-hydroxyethyl)icosa-5,8,11,14-tetraenamide ANANDAMIDE Arachidonoyl ethanolamide (AEA) Arachidonylethanolamide [14C]Anandamide | [3H]Anandamide
Type:
radiolabeled substrate
Emp. Form.:
C22H37NO2
Mol. Mass.:
347.5347
SMILES:
CCCCC\C=C/C\C=C/C\C=C/C\C=C/CCCC(=O)NCCO
: