Target
Metallo-beta-lactamase type 2
Ligand
BDBM262427
Substrate
Meas. Tech.
Class B Enzyme Assay
pH
7±n/a
IC50
2166±n/a nM
Comments
extracted
Citation
 Mandal, MTang, HXiao, LSu, JLi, GYang, SPan, WTang, HDeJesus, RHicks, JLombardo, MChu, HHagmann, WPasternak, AGu, XJiang, JDong, SDing, FLondon, CBiswas, DYoung, KHunter, DNZhao, ZYang, D Metallo-beta-lactamase inhibitors US Patent  US9708336 Publication Date 7/18/2017 
Target
Name:
Metallo-beta-lactamase type 2
Synonyms:
B2 metallo-beta-lactamase BLAB_SERMA IMP-1 | Metallo-beta-lactamase type II
Type:
undefined
Mol. Mass.:
27125.88
Organism:
Serratia marcescens
Description:
P52699
Residue:
246
  
Inhibitor
Name:
BDBM262427
Synonyms:
3-(5-chloro-2-methoxy-1H-benzo[d]imidazol-6-yl)-2-(2H-tetrazol-5-yl)benzenesulfonamide | US9708336, 279
Type:
Small organic molecule
Emp. Form.:
C15H12ClN7O3S
Mol. Mass.:
405.819
SMILES:
COc1nc2cc(Cl)c(cc2[nH]1)-c1cccc(c1-c1nn[nH]n1)S(N)(=O)=O
: