Target
Metallo-beta-lactamase type 2
Ligand
BDBM262437
Substrate
Meas. Tech.
Class B Enzyme Assay
pH
7±n/a
IC50
121±n/a nM
Comments
extracted
Citation
 Mandal, MTang, HXiao, LSu, JLi, GYang, SPan, WTang, HDeJesus, RHicks, JLombardo, MChu, HHagmann, WPasternak, AGu, XJiang, JDong, SDing, FLondon, CBiswas, DYoung, KHunter, DNZhao, ZYang, D Metallo-beta-lactamase inhibitors US Patent  US9708336 Publication Date 7/18/2017 
Target
Name:
Metallo-beta-lactamase type 2
Synonyms:
B2 metallo-beta-lactamase BLAB_SERMA IMP-1 | Metallo-beta-lactamase type II
Type:
undefined
Mol. Mass.:
27125.88
Organism:
Serratia marcescens
Description:
P52699
Residue:
246
  
Inhibitor
Name:
BDBM262437
Synonyms:
5-Chloro-3-(3-oxo-2,3-dihydro-1H-isoindol-5-yl)-2-(2H-tetrazol-5-yl)benzenesulfonamide | US9708336, 289
Type:
Small organic molecule
Emp. Form.:
C15H11ClN6O3S
Mol. Mass.:
390.804
SMILES:
NS(=O)(=O)c1cc(Cl)cc(-c2ccc3CNC(=O)c3c2)c1-c1nn[nH]n1
: