Target
Metallo-beta-lactamase type 2
Ligand
BDBM262520
Substrate
Meas. Tech.
Class B Enzyme Assay
pH
7±n/a
IC50
15.7±n/a nM
Comments
extracted
Citation
 Mandal, MTang, HXiao, LSu, JLi, GYang, SPan, WTang, HDeJesus, RHicks, JLombardo, MChu, HHagmann, WPasternak, AGu, XJiang, JDong, SDing, FLondon, CBiswas, DYoung, KHunter, DNZhao, ZYang, D Metallo-beta-lactamase inhibitors US Patent  US9708336 Publication Date 7/18/2017 
Target
Name:
Metallo-beta-lactamase type 2
Synonyms:
B2 metallo-beta-lactamase BLAB_SERMA IMP-1 | Metallo-beta-lactamase type II
Type:
undefined
Mol. Mass.:
27125.88
Organism:
Serratia marcescens
Description:
P52699
Residue:
246
  
Inhibitor
Name:
BDBM262520
Synonyms:
4'-[(3,3-difluoroazetidin-1- yl)methyl]-2-(1H-tetrazol-5- yl)biphenyl-3-sulfonamide | US9708336, 372
Type:
Small organic molecule
Emp. Form.:
C17H16F2N6O2S
Mol. Mass.:
406.41
SMILES:
NS(=O)(=O)c1cccc(-c2ccc(CN3CC(F)(F)C3)cc2)c1-c1nnn[nH]1
: