Target
Metallo-beta-lactamase type 2
Ligand
BDBM262739
Substrate
Meas. Tech.
Class B Enzyme Assay
pH
7±n/a
IC50
84.1±n/a nM
Comments
extracted
Citation
 Mandal, MTang, HXiao, LSu, JLi, GYang, SPan, WTang, HDeJesus, RHicks, JLombardo, MChu, HHagmann, WPasternak, AGu, XJiang, JDong, SDing, FLondon, CBiswas, DYoung, KHunter, DNZhao, ZYang, D Metallo-beta-lactamase inhibitors US Patent  US9708336 Publication Date 7/18/2017 
Target
Name:
Metallo-beta-lactamase type 2
Synonyms:
B2 metallo-beta-lactamase BLAB_SERMA IMP-1 | Metallo-beta-lactamase type II
Type:
undefined
Mol. Mass.:
27125.88
Organism:
Serratia marcescens
Description:
P52699
Residue:
246
  
Inhibitor
Name:
BDBM262739
Synonyms:
3-((1s,4s)-4- (aminomethyl)cyclohexyl)-6-(2- (piperidin-4-yl)ethyl)-2-(1H- tetrazol-5- yl)benzenesulfonamide | US9708336, 592
Type:
Small organic molecule
Emp. Form.:
C21H33N7O2S
Mol. Mass.:
447.597
SMILES:
NC[C@H]1CC[C@H](CC1)c1ccc(CCC2CCNCC2)c(c1-c1nnn[nH]1)S(N)(=O)=O
: