Target
Carbonic anhydrase 4
Ligand
BDBM26196
Substrate
BDBM10856
Meas. Tech.
CA Inhibition Assay
Ki
634000±n/a nM
Citation
 Innocenti, AVullo, DScozzafava, ASupuran, CT Carbonic anhydrase inhibitors: inhibition of mammalian isoforms I-XIV with a series of substituted phenols including paracetamol and salicylic acid. Bioorg Med Chem 16:7424-8 (2008)  
Target
Name:
Carbonic anhydrase 4
Synonyms:
CA-IV CAH4_HUMAN Carbonic anhydrase Carbonic anhydrase IV (CA IV)
Type:
Enzyme
Mol. Mass.:
35037.98
Organism:
Homo sapiens (Human)
Description:
P22748
Residue:
312
  
Inhibitor
Name:
BDBM26196
Synonyms:
4-cyanophenol phenol derivative, 10
Type:
Small organic molecule
Emp. Form.:
C7H5NO
Mol. Mass.:
119.1207
SMILES:
Oc1ccc(cc1)C#N
:
Substrate
Name:
BDBM10856
Synonyms:
Carbon Dioxide | methanedione
Type:
Small organic molecule
Emp. Form.:
CO2
Mol. Mass.:
44.0095
SMILES:
O=C=O
: