Target
Coagulation factor X
Ligand
BDBM387059
Substrate
Meas. Tech.
In Vitro Assay
Ki
525±n/a nM
Citation
 Ding, ZLai, GChen, SYan, X Hydrazine compound as blood coagulation factor Xa inhibitor US Patent  US9938272 Publication Date 4/10/2018 
Target
Name:
Coagulation factor X
Synonyms:
Activated coagulation factor X (FXa) Coagulation factor X precursor F10 Factor X heavy chain Factor Xa Stuart-Prower factor
Type:
Enzyme
Mol. Mass.:
54726.60
Organism:
Homo sapiens (Human)
Description:
Residue:
488
  
Inhibitor
Name:
BDBM387059
Synonyms:
US9938272, Example 8a | US9938272, Example 8b
Type:
Small organic molecule
Emp. Form.:
C23H28N6O4
Mol. Mass.:
452.5062
SMILES:
COc1ccc(cc1)-n1nc(C(N)=O)c2CCN(C3CCN(CC3)C3CCNC3=O)C(=O)c12
: