Target
Beta-secretase 1
Ligand
BDBM26507
Substrate
Fluorescent Substrate
Meas. Tech.
Enzyme Inhibition Assay
pH
4.5±n/a
Temperature
295.15±n/a K
IC50
30±n/a nM
Citation
 Charrier, NClarke, BCutler, LDemont, EDingwall, CDunsdon, REast, PHawkins, JHowes, CHussain, IJeffrey, PMaile, GMatico, RMosley, JNaylor, AO'Brien, ARedshaw, SRowland, PSoleil, VSmith, KJSweitzer, STheobald, PVesey, DWalter, DSWayne, G Second generation of hydroxyethylamine BACE-1 inhibitors: optimizing potency and oral bioavailability. J Med Chem 51:3313-7 (2008)  
Target
Name:
Beta-secretase 1
Synonyms:
ASP2 Aspartyl protease 2 BACE1 Beta-secretase (BACE) Beta-secretase 1 (BACE 1) Beta-secretase 1 (BACE1) Beta-site amyloid precursor protein cleaving enzyme 1 Memapsin-2 beta-Secretase (BACE-1) | beta-Secretase (BACE1)
Type:
Protein
Mol. Mass.:
55755.10
Organism:
Homo sapiens (Human)
Description:
P56817
Residue:
501
  
Inhibitor
Name:
BDBM26507
Synonyms:
N-[(2S,3R)-4-[(2,6-dimethylheptan-2-yl)amino]-3-hydroxy-1-phenylbutan-2-yl]-3-(1,1-dioxo-1,2-thiazinan-2-yl)-5-(ethylamino)benzamide | sultam hydroxyethylamine (HEA) derivative, 9c
Type:
Small organic molecule
Emp. Form.:
C32H50N4O4S
Mol. Mass.:
586.829
SMILES:
CCNc1cc(cc(c1)C(=O)N[C@@H](Cc1ccccc1)[C@H](O)CNC(C)(C)CCCC(C)C)N1CCCCS1(=O)=O
:
Substrate
Name:
Fluorescent Substrate
Synonyms:
Type:
Peptide
Mol. Mass.:
2030.30
Organism:
Description:
Residue:
18
FAMSEVNLDAEFKTAMRA