Target
Proto-oncogene tyrosine-protein kinase receptor Ret [638-1114]
Ligand
BDBM296869
Substrate
Meas. Tech.
RET Kinase Enzymatic Assay
IC50
<10±n/a nM
Citation
 Demartino, MPGuan, HA Compounds as rearranged during transfection (RET) inhibitors US Patent  US10292975 Publication Date 5/21/2019 
Target
Name:
Proto-oncogene tyrosine-protein kinase receptor Ret [638-1114]
Synonyms:
CDHF12 PTC RET RET_HUMAN
Type:
Protein
Mol. Mass.:
53601.71
Organism:
Homo sapiens (Human)
Description:
P07949[638-1114]
Residue:
477
  
Inhibitor
Name:
BDBM296869
Synonyms:
US10111866, Example 2 US10709695, Example 2
Type:
Small organic molecule
Emp. Form.:
C26H27F4N3O4
Mol. Mass.:
521.5039
SMILES:
CCOc1cc(=O)[nH]cc1-c1ccc(CC(=O)Nc2cc(OCCN(C)C)cc(c2)C(F)(F)F)c(F)c1
: