Target
DNA-(apurinic or apyrimidinic site) endonuclease
Ligand
BDBM26578
Substrate
DNA Substrate
Meas. Tech.
APE1 Inhibition Assay
pH
7.5±n/a
Temperature
303.15±n/a K
IC50
17000±3000 nM
Citation
 Zawahir, ZDayam, RDeng, JPereira, CNeamati, N Pharmacophore guided discovery of small-molecule human apurinic/apyrimidinic endonuclease 1 inhibitors. J Med Chem 52:20-32 (2009)  
Target
Name:
DNA-(apurinic or apyrimidinic site) endonuclease
Synonyms:
APE APEX APEX1_HUMAN Apurinic-apyrimidinic endonuclease 1 (APE-1) DNA-(apurinic or apyrimidinic site) lyase REF1
Type:
Protein
Mol. Mass.:
35560.12
Organism:
Homo sapiens (Human)
Description:
P27695
Residue:
318
  
Inhibitor
Name:
BDBM26578
Synonyms:
3-({5-[(2-carboxyethyl)sulfanyl]-1,3,4-thiadiazol-2-yl}sulfanyl)propanoic acid | A1NI2, 3
Type:
Small organic molecule
Emp. Form.:
C8H10N2O4S3
Mol. Mass.:
294.371
SMILES:
OC(=O)CCSc1nnc(SCCC(O)=O)s1
:
Substrate
Name:
DNA Substrate
Synonyms:
Annealed double-stranded oligonucleotide with an abasic site
Type:
Radiolabeled substrate
Mol. Mass.:
2306.64
Organism:
Description:
The top strand is 5-ATTTCACCGGTACG(F)TCTAGAATCC-3 containing the tetrahydrofuran synthetic abasic residue (F). It is radiolabeled with gamma-32P.
Residue:
26