Target
DNA-(apurinic or apyrimidinic site) endonuclease
Ligand
BDBM26587
Substrate
DNA Substrate
Meas. Tech.
APE1 Inhibition Assay
pH
7.5±n/a
Temperature
303.15±n/a K
IC50
8000±2000 nM
Citation
 Zawahir, ZDayam, RDeng, JPereira, CNeamati, N Pharmacophore guided discovery of small-molecule human apurinic/apyrimidinic endonuclease 1 inhibitors. J Med Chem 52:20-32 (2009)  
Target
Name:
DNA-(apurinic or apyrimidinic site) endonuclease
Synonyms:
APE APEX APEX1_HUMAN Apurinic-apyrimidinic endonuclease 1 (APE-1) DNA-(apurinic or apyrimidinic site) lyase REF1
Type:
Protein
Mol. Mass.:
35560.12
Organism:
Homo sapiens (Human)
Description:
P27695
Residue:
318
  
Inhibitor
Name:
BDBM26587
Synonyms:
2-{[3-(1-carboxyethoxy)-9-oxo-8-oxatricyclo[8.4.0.0^{2,7}]tetradeca-1(14),2(7),3,5,10,12-hexaen-5-yl]oxy}propanoic acid | H1-A1NI2, 12
Type:
Small organic molecule
Emp. Form.:
C19H16O8
Mol. Mass.:
372.3255
SMILES:
CC(Oc1cc(OC(C)C(O)=O)c2c(c1)oc(=O)c1ccccc21)C(O)=O
:
Substrate
Name:
DNA Substrate
Synonyms:
Annealed double-stranded oligonucleotide with an abasic site
Type:
Radiolabeled substrate
Mol. Mass.:
2306.64
Organism:
Description:
The top strand is 5-ATTTCACCGGTACG(F)TCTAGAATCC-3 containing the tetrahydrofuran synthetic abasic residue (F). It is radiolabeled with gamma-32P.
Residue:
26