Target
DNA-(apurinic or apyrimidinic site) endonuclease
Ligand
BDBM26588
Substrate
DNA Substrate
Meas. Tech.
APE1 Inhibition Assay
pH
7.5±n/a
Temperature
303.15±n/a K
IC50
11000±2000 nM
Citation
 Zawahir, ZDayam, RDeng, JPereira, CNeamati, N Pharmacophore guided discovery of small-molecule human apurinic/apyrimidinic endonuclease 1 inhibitors. J Med Chem 52:20-32 (2009)  
Target
Name:
DNA-(apurinic or apyrimidinic site) endonuclease
Synonyms:
APE APEX APEX1_HUMAN Apurinic-apyrimidinic endonuclease 1 (APE-1) DNA-(apurinic or apyrimidinic site) lyase REF1
Type:
Protein
Mol. Mass.:
35560.12
Organism:
Homo sapiens (Human)
Description:
P27695
Residue:
318
  
Inhibitor
Name:
BDBM26588
Synonyms:
2-[10-(carboxymethyl)-6,12-dioxo-5,11-dioxatricyclo[7.3.0.0^{3,7}]dodeca-1,3(7),8-trien-4-yl]acetic acid | H1-A1NI2, 13
Type:
Small organic molecule
Emp. Form.:
C14H10O8
Mol. Mass.:
306.2244
SMILES:
OC(=O)CC1OC(=O)c2cc3C(CC(O)=O)OC(=O)c3cc12
:
Substrate
Name:
DNA Substrate
Synonyms:
Annealed double-stranded oligonucleotide with an abasic site
Type:
Radiolabeled substrate
Mol. Mass.:
2306.64
Organism:
Description:
The top strand is 5-ATTTCACCGGTACG(F)TCTAGAATCC-3 containing the tetrahydrofuran synthetic abasic residue (F). It is radiolabeled with gamma-32P.
Residue:
26