Target
DNA-(apurinic or apyrimidinic site) endonuclease
Ligand
BDBM26601
Substrate
DNA Substrate
Meas. Tech.
APE1 Inhibition Assay
IC50
13000±n/a nM
Citation
 Zawahir, ZDayam, RDeng, JPereira, CNeamati, N Pharmacophore guided discovery of small-molecule human apurinic/apyrimidinic endonuclease 1 inhibitors. J Med Chem 52:20-32 (2009)  
Target
Name:
DNA-(apurinic or apyrimidinic site) endonuclease
Synonyms:
APE APEX APEX1_HUMAN Apurinic-apyrimidinic endonuclease 1 (APE-1) DNA-(apurinic or apyrimidinic site) lyase REF1
Type:
Protein
Mol. Mass.:
35560.12
Organism:
Homo sapiens (Human)
Description:
P27695
Residue:
318
  
Inhibitor
Name:
BDBM26601
Synonyms:
2-{3-[(5Z)-3-(carboxymethyl)-4-oxo-2-sulfanylidene-1,3-thiazolidin-5-ylidene]-2-oxo-2,3-dihydro-1H-indol-1-yl}acetic acid | oxoindole-thioxothiazolidinone, 26
Type:
Small organic molecule
Emp. Form.:
C15H10N2O6S2
Mol. Mass.:
378.38
SMILES:
OC(=O)CN1C(=S)S\C(C1=O)=C1/C(=O)N(CC(O)=O)c2ccccc12
:
Substrate
Name:
DNA Substrate
Synonyms:
Annealed double-stranded oligonucleotide with an abasic site
Type:
Radiolabeled substrate
Mol. Mass.:
2306.64
Organism:
Description:
The top strand is 5-ATTTCACCGGTACG(F)TCTAGAATCC-3 containing the tetrahydrofuran synthetic abasic residue (F). It is radiolabeled with gamma-32P.
Residue:
26