Target
Serine/threonine-protein kinase pim-1
Ligand
BDBM26670
Substrate
S6 Peptide Substrate
Meas. Tech.
Kinase Inhibition Assay
pH
7.6±n/a
Temperature
303.15±n/a K
Ki
550±n/a nM
Citation
 Pierce, ACJacobs, MStuver-Moody, C Docking study yields four novel inhibitors of the protooncogene Pim-1 kinase. J Med Chem 51:1972-5 (2008)  
Target
Name:
Serine/threonine-protein kinase pim-1
Synonyms:
PIM-1 Kinase PIM1_HUMAN Serine/threonine-protein kinase (PIM1) Serine/threonine-protein kinase PIM1 | Serine/threonine-protein kinase pim-1 (PIM1)
Type:
Protein
Mol. Mass.:
35681.82
Organism:
Homo sapiens (Human)
Description:
P11309
Residue:
313
  
Inhibitor
Name:
BDBM26670
Synonyms:
2,3-diphenyl-1H-indole-7-carboxylic acid diphenylindole carboxylic acid, 3
Type:
Small organic molecule
Emp. Form.:
C21H15NO2
Mol. Mass.:
313.3493
SMILES:
OC(=O)c1cccc2c(c([nH]c12)-c1ccccc1)-c1ccccc1
:
Substrate
Name:
S6 Peptide Substrate
Synonyms:
Type:
Peptide
Mol. Mass.:
1118.34
Organism:
Description:
Residue:
9
RRRLSSLRA