Target
Beta-secretase 2
Ligand
BDBM26785
Substrate
Fluorescent Substrate
Meas. Tech.
Enzyme Inhibition Assay
IC50
>100000±n/a nM
Citation
 Beswick, PCharrier, NClarke, BDemont, EDingwall, CDunsdon, RFaller, AGleave, RHawkins, JHussain, IJohnson, CNMacPherson, DMaile, GMatico, RMilner, PMosley, JNaylor, AO'Brien, ARedshaw, SRiddell, DRowland, PSkidmore, JSoleil, VSmith, KJStanway, SStemp, GStuart, ASweitzer, STheobald, PVesey, DWalter, DSWard, JWayne, G BACE-1 inhibitors part 3: identification of hydroxy ethylamines (HEAs) with nanomolar potency in cells. Bioorg Med Chem Lett 18:1022-6 (2008)  
Target
Name:
Beta-secretase 2
Synonyms:
AEPLC ASP1 Asp 1 Aspartyl protease 1 BACE2_HUMAN Beta-secretase (BACE) Beta-secretase 2 (BACE-2) Beta-site APP-cleaving enzyme 2 Memapsin-1 beta-Secretase (BACE-2)
Type:
Protein
Mol. Mass.:
56171.20
Organism:
Homo sapiens (Human)
Description:
Q9Y5Z0
Residue:
518
  
Inhibitor
Name:
BDBM26785
Synonyms:
3-(1,1-dioxo-1,2-thiazinan-2-yl)-5-(ethylamino)-N-[(2R,3S)-2-hydroxy-1-{[(3-methoxyphenyl)methyl]amino}-5-methylhexan-3-yl]benzamide | hydroxy ethylamine (HEA), 20
Type:
Small organic molecule
Emp. Form.:
C28H42N4O5S
Mol. Mass.:
546.722
SMILES:
CCNc1cc(cc(c1)C(=O)N[C@@H](CC(C)C)[C@H](O)CNCc1cccc(OC)c1)N1CCCCS1(=O)=O
:
Substrate
Name:
Fluorescent Substrate
Synonyms:
Type:
Peptide
Mol. Mass.:
2030.30
Organism:
Description:
Residue:
18
FAMSEVNLDAEFKTAMRA