Target
Cathepsin D
Ligand
BDBM26782
Substrate
Fluorescent Substrate
Meas. Tech.
Enzyme Inhibition Assay
IC50
2400±n/a nM
Citation
 Beswick, PCharrier, NClarke, BDemont, EDingwall, CDunsdon, RFaller, AGleave, RHawkins, JHussain, IJohnson, CNMacPherson, DMaile, GMatico, RMilner, PMosley, JNaylor, AO'Brien, ARedshaw, SRiddell, DRowland, PSkidmore, JSoleil, VSmith, KJStanway, SStemp, GStuart, ASweitzer, STheobald, PVesey, DWalter, DSWard, JWayne, G BACE-1 inhibitors part 3: identification of hydroxy ethylamines (HEAs) with nanomolar potency in cells. Bioorg Med Chem Lett 18:1022-6 (2008)  
Target
Name:
Cathepsin D
Synonyms:
CATD_HUMAN CTSD Cathepsin D heavy chain Cathepsin D precursor
Type:
Enzyme
Mol. Mass.:
44551.72
Organism:
Homo sapiens (Human)
Description:
Human proCathepsin D (SwissProt accession number P07339) was expressed in Sf9 cells, purified, and autoactivated.
Residue:
412
  
Inhibitor
Name:
BDBM26782
Synonyms:
N-[(2S,3R)-1-(3,5-difluorophenyl)-3-hydroxy-4-{[(3-methoxyphenyl)methyl]amino}butan-2-yl]-3-(1,1-dioxo-1,2-thiazinan-2-yl)-5-(ethylamino)benzamide | hydroxy ethylamine (HEA), 17
Type:
Small organic molecule
Emp. Form.:
C31H38F2N4O5S
Mol. Mass.:
616.719
SMILES:
CCNc1cc(cc(c1)C(=O)N[C@@H](Cc1cc(F)cc(F)c1)[C@H](O)CNCc1cccc(OC)c1)N1CCCCS1(=O)=O
:
Substrate
Name:
Fluorescent Substrate
Synonyms:
Type:
Peptide
Mol. Mass.:
2030.30
Organism:
Description:
Residue:
18
FAMSEVNLDAEFKTAMRA