Target
Interleukin-6
Ligand
BDBM50070114
Substrate
Meas. Tech.
cytomteric bead array (CBA) assay
Temperature
310.15±n/a K
IC50
>10000±n/a nM
Comments
extracted
Citation
 Gandhi, ADimartino, JChopra, R Methods for the treatment of locally advanced breast cancer US Patent  US9694015 Publication Date 7/4/2017 
Target
Name:
Interleukin-6
Synonyms:
B-cell stimulatory factor 2 CDF Hybridoma growth factor IFNB2 IL6 Interferon beta-2
Type:
Mol. Mass.:
23717.96
Organism:
Homo sapiens (Human)
Description:
P05231
Residue:
212
  
Inhibitor
Name:
BDBM50070114
Synonyms:
(+/-)-thalidomide 2-(2,6-dioxopiperidin-3-yl)isoindoline-1,3-dione K-17 Thalomid [(R,S)-2-(2,6-dioxo-3-piperidinyl)-1H-isoindole-1,3(2H)-dione
Type:
Small organic molecule
Emp. Form.:
C13H10N2O4
Mol. Mass.:
258.2295
SMILES:
O=C1N(C2CCC(=O)NC2=O)C(=O)c2ccccc12
: