Target
Interstitial collagenase
Ligand
BDBM26809
Substrate
MMP Substrate Peptide
Meas. Tech.
Enzyme Inhibition Assay
pH
7.5±n/a
Temperature
298.15±n/a K
Ki
>4948±n/a nM
Citation
 Ott, GRAsakawa, NLiu, RQCovington, MBQian, MVaddi, KNewton, RCTrzaskos, JMChrist, DDGalya, LScholz, TMarshall, WDuan, JJ Alpha,Beta-cyclic-beta-benzamido hydroxamic acids: Novel oxaspiro[4.4]nonane templates for the discovery of potent, selective, orally bioavailable inhibitors of tumor necrosis factor-alpha converting enzyme (TACE). Bioorg Med Chem Lett 18:1288-92 (2008)  
Target
Name:
Interstitial collagenase
Synonyms:
CLG MMP1 Matrix metalloproteinase-1 | Matrix metalloproteinase-1 (MMP-1)
Type:
Enzyme
Mol. Mass.:
54010.26
Organism:
Homo sapiens (Human)
Description:
P03956
Residue:
469
  
Inhibitor
Name:
BDBM26809
Synonyms:
(5R,7S,8R)-7-N-hydroxy-8-N-{4-[(2-methylquinolin-4-yl)methoxy]benzene}-1-oxaspiro[4.4]nonane-7,8-diamido | spiroether beta-amino hydroxamate , 18
Type:
Small organic molecule
Emp. Form.:
C27H29N3O5
Mol. Mass.:
475.5363
SMILES:
Cc1cc(COc2ccc(cc2)C(=O)N[C@@H]2C[C@@]3(CCCO3)C[C@@H]2C(=O)NO)c2ccccc2n1
:
Substrate
Name:
MMP Substrate Peptide
Synonyms:
Type:
Fluorogenic Peptide
Mol. Mass.:
2468.31
Organism:
Description:
MCA, (7-methoxycoumarin-4-yl)acetyl. Dpa, N-3-(2,4-dinitrophenyl)-L-2,3-diaminopropionyl.
Residue:
23