Target
72 kDa type IV collagenase
Ligand
BDBM26808
Substrate
MMP Substrate Peptide
Meas. Tech.
Enzyme Inhibition Assay
pH
7.5±n/a
Temperature
298.15±n/a K
Ki
2800±n/a nM
Citation
 Ott, GRAsakawa, NLiu, RQCovington, MBQian, MVaddi, KNewton, RCTrzaskos, JMChrist, DDGalya, LScholz, TMarshall, WDuan, JJ Alpha,Beta-cyclic-beta-benzamido hydroxamic acids: Novel oxaspiro[4.4]nonane templates for the discovery of potent, selective, orally bioavailable inhibitors of tumor necrosis factor-alpha converting enzyme (TACE). Bioorg Med Chem Lett 18:1288-92 (2008)  
Target
Name:
72 kDa type IV collagenase
Synonyms:
72 kDa gelatinase CLG4A Gelatinase A (MMP-2) MMP2_HUMAN Matrix metalloproteinase-2 (MMP 2) Matrix metalloproteinases 2 (MMP-2) | TBE-1
Type:
Enzyme
Mol. Mass.:
73870.36
Organism:
Homo sapiens (Human)
Description:
P08253
Residue:
660
  
Inhibitor
Name:
BDBM26808
Synonyms:
(7S,8R)-7-N-hydroxy-8-N-{4-[(2-methylquinolin-4-yl)methoxy]benzene}-1,4-dioxaspiro[4.4]nonane-7,8-diamido | 1,3-dioxolane beta-amino hydroxamate , 1
Type:
Small organic molecule
Emp. Form.:
C26H27N3O6
Mol. Mass.:
477.5091
SMILES:
Cc1cc(COc2ccc(cc2)C(=O)N[C@@H]2C[C@@]3(C[C@@H]2C(=O)NO)OCCO3)c2ccccc2n1
:
Substrate
Name:
MMP Substrate Peptide
Synonyms:
Type:
Fluorogenic Peptide
Mol. Mass.:
2468.31
Organism:
Description:
MCA, (7-methoxycoumarin-4-yl)acetyl. Dpa, N-3-(2,4-dinitrophenyl)-L-2,3-diaminopropionyl.
Residue:
23