Target
Tyrosine-protein kinase FRK
Ligand
BDBM50184766
Substrate
Meas. Tech.
Kinase Screening Assay
IC50
550±n/a nM
Citation
 Unciti-Broceta, AFraser, CO. Carragher, N Compounds US Patent  US10294227 Publication Date 5/21/2019 
Target
Name:
Tyrosine-protein kinase FRK
Synonyms:
FRK FYN-related kinase PTK5 SRC | Tyrosine Kinase FRK
Type:
Tyrosine-protein kinase
Mol. Mass.:
58254.41
Organism:
Homo sapiens (Human)
Description:
P42685
Residue:
505
  
Inhibitor
Name:
BDBM50184766
Synonyms:
CHEMBL3823861 | US10294227, Code 221
Type:
Small organic molecule
Emp. Form.:
C22H29N9
Mol. Mass.:
419.526
SMILES:
CN(C)CC1CCN(CCn2nc(-c3cnc4[nH]ccc4c3)c3c(N)ncnc23)CC1
: