Target
Tyrosine-protein kinase ITK/TSK
Ligand
BDBM26867
Substrate
poly Glu4: Tyr
Meas. Tech.
Dissociation Enhanced Lanthanide Fluoroimmunoassay (DELFIA)
pH
7±n/a
Temperature
295.15±n/a K
IC50
13±n/a nM
Citation
 Lo, HYBentzien, JFleck, RWPullen, SSKhine, HHWoska, JRKugler, SZKashem, MATakahashi, H 2-Aminobenzimidazoles as potent ITK antagonists: trans-stilbene-like moieties targeting the kinase specificity pocket. Bioorg Med Chem Lett 18:6218-21 (2008)  
Target
Name:
Tyrosine-protein kinase ITK/TSK
Synonyms:
EMT ITK_HUMAN LYK Tyrosine-protein kinase ITK Tyrosine-protein kinase Lyk
Type:
Protein
Mol. Mass.:
71839.20
Organism:
Homo sapiens (Human)
Description:
Q08881
Residue:
620
  
Inhibitor
Name:
BDBM26867
Synonyms:
2-aminobenzimidazole with trans-stilbene, 8i | N-[(2E)-5-[benzene(methyl)amido]-1-(2-carbamoylethyl)-2,3-dihydro-1H-1,3-benzodiazol-2-ylidene]-5-[(E)-2-(3-methoxyphenyl)ethenyl]thiophene-2-carboxamide
Type:
Small organic molecule
Emp. Form.:
C32H29N5O4S
Mol. Mass.:
579.669
SMILES:
COc1cccc(\C=C\c2ccc(s2)C(=O)Nc2nc3cc(ccc3n2CCC(N)=O)N(C)C(=O)c2ccccc2)c1
:
Substrate
Name:
poly Glu4: Tyr
Synonyms:
PGTYR-biotin
Type:
Random copolymer
Mol. Mass.:
358.43
Organism:
Description:
Residue:
3
NA