Target
Insulin receptor
Ligand
BDBM26880
Substrate
poly Glu4: Tyr
Meas. Tech.
Dissociation Enhanced Lanthanide Fluoroimmunoassay (DELFIA)
IC50
3800±n/a nM
Citation
 Lo, HYBentzien, JFleck, RWPullen, SSKhine, HHWoska, JRKugler, SZKashem, MATakahashi, H 2-Aminobenzimidazoles as potent ITK antagonists: trans-stilbene-like moieties targeting the kinase specificity pocket. Bioorg Med Chem Lett 18:6218-21 (2008)  
Target
Name:
Insulin receptor
Synonyms:
INSR INSR_HUMAN Insulin receptor beta subunit
Type:
Receptor Tyrosine Kinase
Mol. Mass.:
156322.60
Organism:
Homo sapiens (Human)
Description:
P06213
Residue:
1382
  
Inhibitor
Name:
BDBM26880
Synonyms:
2-aminobenzimidazole with trans-stilbene, 8w | 5-[(E)-2-(6-aminopyridin-2-yl)ethenyl]-N-[(2E)-5-[benzene(methyl)amido]-1-(2-carbamoylethyl)-2,3-dihydro-1H-1,3-benzodiazol-2-ylidene]thiophene-2-carboxamide
Type:
Small organic molecule
Emp. Form.:
C30H27N7O3S
Mol. Mass.:
565.645
SMILES:
CN(C(=O)c1ccccc1)c1ccc2n(CCC(N)=O)c(NC(=O)c3ccc(C=Cc4cccc(N)n4)s3)nc2c1
:
Substrate
Name:
poly Glu4: Tyr
Synonyms:
PGTYR-biotin
Type:
Random copolymer
Mol. Mass.:
358.43
Organism:
Description:
Residue:
3
NA