Target
Sodium-dependent noradrenaline transporter
Ligand
BDBM388471
Substrate
Meas. Tech.
Uptake Assay Protocol
Ki
1.40±n/a nM
Citation
 Richelson, EFauq, AHCarlier, PMonceaux, CJ Inhibiting neurotransmitter reuptake US Patent  US9944618 Publication Date 4/17/2018 
Target
Name:
Sodium-dependent noradrenaline transporter
Synonyms:
Monoamine transporter NET Noradrenaline Transporter (NET) Norepinephrine transporter protein (NET) SLC6A2 Sodium-dependent noradrenaline transporter (NET) | Solute carrier family 6 member 2
Type:
Multi-pass membrane protein
Mol. Mass.:
69337.72
Organism:
Homo sapiens (Human)
Description:
P23975
Residue:
617
  
Inhibitor
Name:
BDBM388471
Synonyms:
US9944618, Compound ID No. 5
Type:
Small organic molecule
Emp. Form.:
C20H21N
Mol. Mass.:
275.3874
SMILES:
CNC[C@@H](Cc1ccccc1)c1ccc2ccccc2c1
: