Target
Nitric oxide synthase, inducible
Ligand
BDBM50093349
Substrate
Meas. Tech.
Inhibition Assay
Ki
3669±223 nM
Citation
 Silverman, RBJing, QKang, SWang, H Mammalian and bacterial nitric oxide synthase inhibitors US Patent  US9951014 Publication Date 4/24/2018 
Target
Name:
Nitric oxide synthase, inducible
Synonyms:
HEP-NOS Inducible NO synthase NOS type II NOS2A Nitric oxide synthase, inducible (iNOS) | iNOS
Type:
Homodimer
Mol. Mass.:
131141.95
Organism:
Homo sapiens (Human)
Description:
P35228
Residue:
1153
  
Inhibitor
Name:
BDBM50093349
Synonyms:
CHEMBL3586664 | US9951014, Name 19c
Type:
Small organic molecule
Emp. Form.:
C19H25N5
Mol. Mass.:
323.4353
SMILES:
CNCCN(C)c1cc(CCc2cc(C)cc(N)n2)cc(c1)C#N
: