Target
Nitric oxide synthase, endothelial
Ligand
BDBM50093349
Substrate
Meas. Tech.
Inhibition Assay
Ki
24950±1684 nM
Citation
 Silverman, RBJing, QKang, SWang, H Mammalian and bacterial nitric oxide synthase inhibitors US Patent  US9951014 Publication Date 4/24/2018 
Target
Name:
Nitric oxide synthase, endothelial
Synonyms:
Constitutive NOS Endothelial NOS NOS type III NOS3_HUMAN Nitric oxide synthase (inducible and endothelial) Nitric-oxide synthase (endothelial and brain) eNOS
Type:
Enzyme Catalytic Domain
Mol. Mass.:
133297.84
Organism:
Homo sapiens (Human)
Description:
P29474
Residue:
1203
  
Inhibitor
Name:
BDBM50093349
Synonyms:
CHEMBL3586664 | US9951014, Name 19c
Type:
Small organic molecule
Emp. Form.:
C19H25N5
Mol. Mass.:
323.4353
SMILES:
CNCCN(C)c1cc(CCc2cc(C)cc(N)n2)cc(c1)C#N
: